Reaction Details
TargetAngiotensin-converting enzyme
LigandBDBM50282846
Substrate/Competitorn/a
Meas. Tech.ChEBML_34792
IC50 10±n/a nM
Citation Delaney, NGBarrish, JCNeubeck, RNatarajan, SCohen, MRovnyak, GCHuber, GMurugesan, NGirotra, RSieber-McMaster, ERobl, JAAsaad, MMCheung, HSBird, JWaldron, TPetrillo, EW Mercaptoacyl dipeptides as dual inhibitors of angiotensin-converting enzyme and neutral endopeptidase. Preliminary structure-activity studies Bioorg Med Chem Lett4:1783-1788 (1994)    Article
 
Angiotensin-converting enzyme
Name:Angiotensin-converting enzyme
Type:n/a
Mol. Mass.:150405.15
Organism:Oryctolagus cuniculus
Description:n/a
Residue:1310
BDBM50282846
NameBDBM50282846
Synonyms:(S)-1-[(S)-3-(1H-Indol-3-yl)-2-((S)-2-mercaptomethyl-3-phenyl-propionylamino)-propionyl]-pyrrolidine-2-carboxylic acid | CHEMBL50954
TypeSmall organic molecule
Emp. Form.C26H29N3O4S
Mol. Mass.479.591
SMILESOC(=O)[C@@H]1CCCN1C(=O)[C@H](Cc1c[nH]c2ccccc12)NC(=O)[C@@H](CS)Cc1ccccc1