Reaction Details
TargetNeprilysin
LigandBDBM50282844
Substrate/Competitorn/a
Meas. Tech.ChEBML_144599
IC50 40±n/a nM
Citation Delaney, NGBarrish, JCNeubeck, RNatarajan, SCohen, MRovnyak, GCHuber, GMurugesan, NGirotra, RSieber-McMaster, ERobl, JAAsaad, MMCheung, HSBird, JWaldron, TPetrillo, EW Mercaptoacyl dipeptides as dual inhibitors of angiotensin-converting enzyme and neutral endopeptidase. Preliminary structure-activity studies Bioorg Med Chem Lett4:1783-1788 (1994)    Article
 
Neprilysin
Name:Neprilysin
Type:Protein
Mol. Mass.:85789.59
Organism:Rattus norvegicus (Rat)
Description:P07861
Residue:750
BDBM50282844
NameBDBM50282844
Synonyms:1-{2-[3-(4-Benzyloxy-phenyl)-2-mercaptomethyl-propionylamino]-propionyl}-pyrrolidine-2-carboxylic acid | CHEMBL295936
TypeSmall organic molecule
Emp. Form.C25H30N2O5S
Mol. Mass.470.581
SMILESC[C@H](NC(=O)[C@@H](CS)Cc1ccc(OCc2ccccc2)cc1)C(=O)N1CCC[C@@H]1C(O)=O