Reaction Details
TargetAngiotensin-converting enzyme
LigandBDBM50282855
Substrate/Competitorn/a
Meas. Tech.ChEBML_34792
IC50 10±n/a nM
Citation Delaney, NGBarrish, JCNeubeck, RNatarajan, SCohen, MRovnyak, GCHuber, GMurugesan, NGirotra, RSieber-McMaster, ERobl, JAAsaad, MMCheung, HSBird, JWaldron, TPetrillo, EW Mercaptoacyl dipeptides as dual inhibitors of angiotensin-converting enzyme and neutral endopeptidase. Preliminary structure-activity studies Bioorg Med Chem Lett4:1783-1788 (1994)    Article
 
Angiotensin-converting enzyme
Name:Angiotensin-converting enzyme
Type:n/a
Mol. Mass.:150405.15
Organism:Oryctolagus cuniculus
Description:n/a
Residue:1310
BDBM50282855
NameBDBM50282855
Synonyms:(S)-1-[(S)-2-((S)-2-Mercaptomethyl-3-phenyl-propionylamino)-pentanoyl]-pyrrolidine-2-carboxylic acid | CHEMBL51988
TypeSmall organic molecule
Emp. Form.C20H28N2O4S
Mol. Mass.392.512
SMILESCCC[C@H](NC(=O)[C@@H](CS)Cc1ccccc1)C(=O)N1CCC[C@H]1C(O)=O