Reaction Details
Target3-phosphoshikimate 1-carboxyvinyltransferase
LigandBDBM50283575
Substrate/Competitorn/a
Meas. Tech.ChEMBL_64948 (CHEMBL675693)
IC50 1400000±n/a nM
Citation Miller, MJBraccolino, DSClearly, DGReam, JEWalker, MCSikorski, JA EPSP synthase inhibitor design IV. New aromatic substrate analogs and symmetrical inhibitors containing novel 3-phosphate mimics. Bioorg Med Chem Lett4:2605-2608 (1994)    Article
 
3-phosphoshikimate 1-carboxyvinyltransferase
Name:3-phosphoshikimate 1-carboxyvinyltransferase
Type:PROTEIN
Mol. Mass.:46089.22
Organism:Escherichia coli (strain K12)
Description:ChEMBL_65087
Residue:427
BDBM50283575
NameBDBM50283575
Synonyms:3-Carboxymethoxy-5-phosphonooxy-benzoic acid; trisodium | CHEMBL89899
TypeSmall organic molecule
Emp. Form.C9H6O9P
Mol. Mass.289.1139
SMILESOP([O-])(=O)Oc1cc(OCC([O-])=O)cc(c1)C([O-])=O