Reaction Details
Target3-phosphoshikimate 1-carboxyvinyltransferase
LigandBDBM50283582
Substrate/Competitorn/a
Meas. Tech.ChEMBL_64948 (CHEMBL675693)
IC50 210000±n/a nM
Citation Miller, MJBraccolino, DSClearly, DGReam, JEWalker, MCSikorski, JA EPSP synthase inhibitor design IV. New aromatic substrate analogs and symmetrical inhibitors containing novel 3-phosphate mimics. Bioorg Med Chem Lett4:2605-2608 (1994)    Article
 
3-phosphoshikimate 1-carboxyvinyltransferase
Name:3-phosphoshikimate 1-carboxyvinyltransferase
Type:PROTEIN
Mol. Mass.:46089.22
Organism:Escherichia coli (strain K12)
Description:ChEMBL_65087
Residue:427
BDBM50283582
NameBDBM50283582
Synonyms:2-(3-Carboxy-5-dicarboxymethoxy-phenoxy)-malonic acid | CHEMBL329115
TypeSmall organic molecule
Emp. Form.C13H10O12
Mol. Mass.358.2113
SMILESOC(=O)C(Oc1cc(OC(C(O)=O)C(O)=O)cc(c1)C(O)=O)C(O)=O