Reaction Details
TargetAngiotensin-converting enzyme 2
LigandBDBM50283633
Substrate/Competitorn/a
Meas. Tech.ChEMBL_35588 (CHEMBL876577)
IC50 656±n/a nM
Citation De Lombaert, STan, JStamford, LJSakane, YBerry, CGhai, RD Dual inhibition of neutral endopeptidase and angiotensin-converting enzyme by N-phosphonomethyl and N-carboxyalkyl dipeptides Bioorg Med Chem Lett4:2715-2720 (1994)    Article
 
Angiotensin-converting enzyme 2
Name:Angiotensin-converting enzyme 2
Type:n/a
Mol. Mass.:n/a
Description:ASSAY_ID of EBI is 35589
Components:This complex has 2 components.
Component 1
Name:Angiotensin-converting enzyme
Synonyms:ACE Angiotensin converting enzyme (ACE) Angiotensin-converting enzyme, soluble form CD_antigen=CD143 DCP1 Kininase II
Type:Enzyme
Mol. Mass.:149709.01
Organism:Homo sapiens (Human)
Description:n/a
Residue:1306
Component 2
Name:Angiotensin-converting enzyme 2
Synonyms:ACE-related carboxypeptidase ACE2_HUMAN Angiotensin-converting enzyme homolog Metalloprotease MPROT15
Type:Enzyme
Mol. Mass.:92448.86
Organism:Homo sapiens (Human)
Description:n/a
Residue:805
BDBM50283633
NameBDBM50283633
Synonyms:(S)-2-{(S)-3-Benzyloxy-2-[((S)-phosphonomethyl)-amino]-butyrylamino}-3-biphenyl-4-yl-propionic acid | CHEMBL366503
TypeSmall organic molecule
Emp. Form.C27H31N2O7P
Mol. Mass.526.518
SMILESC[C@H](OCc1ccccc1)[C@H](NCP(O)(O)=O)C(=O)N[C@@H](Cc1ccc(cc1)-c1ccccc1)C(O)=O