Reaction Details
TargetNeprilysin
LigandBDBM50085459
Substrate/Competitorn/a
Meas. Tech.ChEBML_144632
IC50 3±n/a nM
Citation De Lombaert, STan, JStamford, LJSakane, YBerry, CGhai, RD Dual inhibition of neutral endopeptidase and angiotensin-converting enzyme by N-phosphonomethyl and N-carboxyalkyl dipeptides Bioorg Med Chem Lett4:2715-2720 (1994)    Article
 
Neprilysin
Name:Neprilysin
Type:Enzyme
Mol. Mass.:85505.38
Organism:Homo sapiens (Human)
Description:P08473
Residue:750
BDBM50085459
NameBDBM50085459
Synonyms:(S)-3-Biphenyl-4-yl-2-[(S)-3-methyl-2-(phosphonomethyl-amino)-butyrylamino]-propionic acid | CHEMBL89563
TypeSmall organic molecule
Emp. Form.C21H27N2O6P
Mol. Mass.434.4226
SMILESCC(C)[C@H](NCP(O)(O)=O)C(=O)N[C@@H](Cc1ccc(cc1)-c1ccccc1)C(O)=O