Reaction Details
TargetAngiotensin-converting enzyme
LigandBDBM21642
Substrate/Competitorn/a
Meas. Tech.ChEBML_35571
IC50 20±n/a nM
Citation Kim, BHRyu, EJChung, YJ Novel angiotensin converting enzyme inhibitors containing -hydroxy ketomethylene dipeptide isosteres Bioorg Med Chem Lett4:2799-2804 (1994)    Article
 
Angiotensin-converting enzyme
Name:Angiotensin-converting enzyme
Type:n/a
Mol. Mass.:150405.15
Organism:Oryctolagus cuniculus
Description:n/a
Residue:1310
BDBM21642
NameBDBM21642
Synonyms:(2S)-1-[(2S)-2-methyl-3-sulfanylpropanoyl]pyrrolidine-2-carboxylic acid Capozide Lopirin SQ14534 | US11491146, Compound L-Captopril
TypeSmall organic molecule
Emp. Form.C9H15NO3S
Mol. Mass.217.285
SMILESC[C@H](CS)C(=O)N1CCC[C@H]1C(O)=O