Reaction Details
TargetKappa-type opioid receptor
LigandBDBM50000780
Substrate/Competitorn/a
Meas. Tech.ChEBML_92409
Ki 1±n/a nM
Citation Gottschlich, RAckermann, KBarber, ABartoszyk, GGreiner, H EMD 61 753 as a favourable representative of structurally novel arylacetamido-type K opiate receptor agonists Bioorg Med Chem Lett4:677-682 (1994)    Article
 
Kappa-type opioid receptor
Name:Kappa-type opioid receptor
Type:G Protein-Coupled Receptor (GPCR)
Mol. Mass.:42744.99
Organism:Cavia porcellus (domestic guinea pig)
Description:P41144
Residue:380
BDBM50000780
NameBDBM50000780
Synonyms:2-(3,4-Dichloro-phenyl)-N-methyl-N-(2-pyrrolidin-1-yl-cyclohexyl)-acetamide CHEMBL593781
TypeSmall organic molecule
Emp. Form.C19H26Cl2N2O
Mol. Mass.369.329
SMILESCN([C@H]1CCCC[C@@H]1N1CCCC1)C(=O)Cc1ccc(Cl)c(Cl)c1