Reaction Details
TargetCalpain-2 catalytic subunit
LigandBDBM50284780
Substrate/Competitorn/a
Meas. Tech.ChEMBL_43856 (CHEMBL658517)
IC50 104±n/a nM
Citation Woo, JSigeizumi, SYamaguchi, KSugimoto, KKobori, TTsuji, TKondo, K Peptidyl aldehyde derivatives as potent and selective inhibitors of cathepsin L Bioorg Med Chem Lett5:1501-1504 (1995)    Article
 
Calpain-2 catalytic subunit
Name:Calpain-2 catalytic subunit
Type:Protein
Mol. Mass.:79965.18
Organism:Homo sapiens (Human)
Description:n/a
Residue:700
BDBM50284780
NameBDBM50284780
Synonyms:CHEMBL36801 | Z-Phe-Phe-H
TypeSmall organic molecule
Emp. Form.C26H26N2O5
Mol. Mass.446.495
SMILESOC(=O)[C@H](Cc1ccccc1)NC(=O)[C@H](Cc1ccccc1)NC(=O)OCc1ccccc1