Reaction Details
TargetBeta-lactamase
LigandBDBM50021959
Substrate/Competitorn/a
Meas. Tech.ChEBML_40415
IC50>20000±n/a nM
Citation Buynak, JDGeng, BBachmann, BLing, Hua The synthesis and lactamase inhibitory activity of 6-(carboxymethylene)penicillins and 7-(carboxymethylene)cephalosporins Bioorg Med Chem Lett5:1513-1518 (1995)    Article
 
Beta-lactamase
Name:Beta-lactamase
Type:PROTEIN
Mol. Mass.:41306.67
Organism:Enterobacter cloacae
Description:ChEMBL_40258
Residue:381
BDBM50021959
NameBDBM50021959
Synonyms:CHEMBL777 US9120808, Clavulanic acid potassium salt clavulanic acid
TypeSmall organic molecule
Emp. Form.C8H9NO5
Mol. Mass.199.1608
SMILESOC\C=C1/O[C@@H]2CC(=O)N2[C@H]1C(O)=O