Reaction Details
TargetDelta-type opioid receptor
LigandBDBM50285003
Substrate/Competitorn/a
Meas. Tech.ChEBML_53445
Ki 49±n/a nM
Citation Schmidhammer, HStangl, AFurst, ZSzabo, EBorsodi, APatel, DTraynor, JR Synthesis and biological evaluation of 14-alkoxymorphinans.12.1 A phenethyl analogue of the -selective opioid receptor antagonist cyprodime Bioorg Med Chem Lett5:1923-1926 (1995)    Article
 
Delta-type opioid receptor
Name:Delta-type opioid receptor
Type:G Protein-Coupled Receptor (GPCR)
Mol. Mass.:40382.98
Organism:Homo sapiens (Human)
Description:Competition binding assays were carried out using membrane preparations from transfected HN9.10 cells that constitutively expressed the delta opioid receptor.
Residue:372
BDBM50285003
NameBDBM50285003
Synonyms:3,10-dimethoxy-17-phenethyl-17-azatetracyclo[7.5.3.01,10.02,7]heptadeca-2(7),3,5-trien-13-one; with HBr | CHEMBL545208
TypeSmall organic molecule
Emp. Form.C26H31NO3
Mol. Mass.405.5292
SMILESCOc1cccc2CC3N(CCc4ccccc4)CC[C@@]4(CC(=O)CC[C@@]34OC)c12