Reaction Details
TargetSqualene synthase
LigandBDBM50285065
Substrate/Competitorn/a
Meas. Tech.ChEBML_201928
IC50 1.2±n/a nM
Citation Iwasawa, YHayashi, MNomoto, TShibata, JMitsuya, MHirota, KYonemoto, MKamei, TMiura, KTomimoto, K Synthesis and biological activity of J-104,118, a novel, potent inhibitor of squalene synthase Bioorg Med Chem Lett5:1989-1994 (1995)    Article
 
Squalene synthase
Name:Squalene synthase
Type:PROTEIN
Mol. Mass.:48114.76
Organism:Homo sapiens (Human)
Description:ChEMBL_1352847
Residue:417
BDBM50285065
NameBDBM50285065
Synonyms:(S)-2-{[(1S,2S)-2-Biphenyl-4-yl-3-(3,4-dichloro-phenyl)-1-methyl-propylcarbamoyl]-methyl}-succinic acid | CHEMBL61935
TypeSmall organic molecule
Emp. Form.C28H27Cl2NO5
Mol. Mass.528.424
SMILESC[C@H](NC(=O)C[C@@H](CC(O)=O)C(O)=O)[C@@H](Cc1ccc(Cl)c(Cl)c1)c1ccc(cc1)-c1ccccc1