Reaction Details
TargetProtein kinase C eta type
LigandBDBM50285242
Substrate/Competitorn/a
Meas. Tech.ChEMBL_161127 (CHEMBL770098)
IC50 3±n/a nM
Citation Lai, YMendoza, JHubbard, FKalter, K Synthesis and PKC inhibitory activities of balanol analogs with a cyclopentane substructure Bioorg Med Chem Lett5:2155-2160 (1995)    Article
 
Protein kinase C eta type
Name:Protein kinase C eta type
Type:Enzyme
Mol. Mass.:77844.26
Organism:Homo sapiens (Human)
Description:The recombinant human PKC enzymes were produced using a baculovirus expression system in SF9 cells
Residue:683
BDBM50285242
NameBDBM50285242
Synonyms:4-(2-Carboxy-6-hydroxy-benzoyl)-3,5-dihydroxy-benzoic acid (3R,5R)-4-aminomethyl-2-((S)-4-hydroxy-benzoylamino)-cyclopentyl ester | CHEMBL67290
TypeSmall organic molecule
Emp. Form.C28H26N2O10
Mol. Mass.550.5134
SMILESNC[C@@H]1C[C@H](NC(=O)c2ccc(O)cc2)[C@@H](C1)OC(=O)c1cc(O)c(C(=O)c2c(O)cccc2C(O)=O)c(O)c1