Reaction Details
TargetProtein kinase C alpha type
LigandBDBM50285239
Substrate/Competitorn/a
Meas. Tech.ChEBML_160110
IC50 10±n/a nM
Citation Lai, YMendoza, JHubbard, FKalter, K Synthesis and PKC inhibitory activities of balanol analogs with a cyclopentane substructure Bioorg Med Chem Lett5:2155-2160 (1995)    Article
 
Protein kinase C alpha type
Name:Protein kinase C alpha type
Type:Enzyme
Mol. Mass.:76755.65
Organism:Homo sapiens (Human)
Description:The recombinant human PKC enzymes were produced using a baculovirus expression system in SF9 cells
Residue:672
BDBM50285239
NameBDBM50285239
Synonyms:4-(2-Carboxy-6-hydroxy-benzoyl)-3,5-dihydroxy-benzoic acid (3S,5R)-2-((S)-4-hydroxy-benzoylamino)-4-hydroxymethyl-cyclopentyl ester | CHEMBL306427
TypeSmall organic molecule
Emp. Form.C28H25NO11
Mol. Mass.551.4982
SMILESOC[C@H]1C[C@H](NC(=O)c2ccc(O)cc2)[C@@H](C1)OC(=O)c1cc(O)c(C(=O)c2c(O)cccc2C(O)=O)c(O)c1