Reaction Details
TargetLysosomal alpha-glucosidase
LigandBDBM50285806
Substrate/Competitorn/a
Meas. Tech.ChEBML_37554
Ki 4000000±n/a nM
Citation Bleriot, YDintinger, TGenre-Grandpierre, APadrines, MTellier, C Inhibition of glycosidases by substituted amidines Bioorg Med Chem Lett5:2655-2660 (1995)    Article
 
Lysosomal alpha-glucosidase
Name:Lysosomal alpha-glucosidase
Type:PROTEIN
Mol. Mass.:105312.45
Organism:Homo sapiens (Human)
Description:ChEMBL_1506060
Residue:952
BDBM50285806
NameBDBM50285806
Synonyms:5-benzylamino-3,4-dihydro-2H-2-pyrroliumylmethanol
TypeSmall organic molecule
Emp. Form.C12H17N2O
Mol. Mass.205.2756
SMILESOCC1CCC(NCc2ccccc2)=[NH+]1