Reaction Details
TargetDNA topoisomerase 2-alpha/2-beta
LigandBDBM50286486
Substrate/Competitorn/a
Meas. Tech.ChEMBL_208605 (CHEMBL812282)
EC50 2600±n/a nM
Citation Wentland, MPAldous, SCGruett, MDPerni, RBPowles, RGDanz, DWKlingbeil, KMPeverly, ARobinson, RGCorbett, THRake, JBCoughlin, SA The antitumor activity of novel pyrazoloquinoline derivatives Bioorg Med Chem Lett5:405-410 (1995)    Article
 
DNA topoisomerase 2-alpha/2-beta
Name:DNA topoisomerase 2-alpha/2-beta
Synonyms:DNA topoisomerase II
Type:n/a
Mol. Mass.:n/a
Description:ASSAY_ID of ChEMBL is 1821483
Components:This complex has 2 components.
Component 1
Name:DNA topoisomerase 2-alpha
Type:Protein
Mol. Mass.:174415.30
Organism:Homo sapiens (Human)
Description:P11388
Residue:1531
Component 2
Name:DNA topoisomerase 2-beta
Synonyms:DNA topoisomerase II TOP2B | TOP2B_HUMAN
Type:PROTEIN
Mol. Mass.:183284.13
Organism:Homo sapiens (Human)
Description:ChEMBL_51583
Residue:1626
BDBM50286486
NameBDBM50286486
Synonyms:5-Cyclopropyl-2-(2-dimethylamino-ethyl)-7-(2,6-dimethyl-pyridin-4-yl)-6,8-difluoro-2,5-dihydro-pyrazolo[4,3-c]quinolin-3-one | CHEMBL130381
TypeSmall organic molecule
Emp. Form.C24H25F2N5O
Mol. Mass.437.485
SMILESCN(C)CCn1nc2c(cn(C3CC3)c3c(F)c(c(F)cc23)-c2cc(C)nc(C)c2)c1=O