Reaction Details
Target5-hydroxytryptamine receptor 4
LigandBDBM50056419
Substrate/Competitorn/a
Meas. Tech.ChEBML_3342
Ki 383±n/a nM
Citation Langlois, MYang, DBremont, BShen, S Synthesis and pharmacological activity of a macrocyclic benzamide Bioorg Med Chem Lett5:795-798 (1995)    Article
 
5-hydroxytryptamine receptor 4
Name:5-hydroxytryptamine receptor 4
Type:Enzyme Catalytic Domain
Mol. Mass.:46117.31
Organism:RAT
Description:5-HT4 HTR4 RAT::Q62758
Residue:406
BDBM50056419
NameBDBM50056419
Synonyms:4-Amino-N-(1-aza-bicyclo[2.2.2]oct-3-yl)-5-chloro-2-((S)-methoxy)-benzamide 4-Amino-N-(S)-1-aza-bicyclo[2.2.2]oct-3-yl-5-chloro-2-methoxy-benzamide ZACOPRIDE,R
TypeSmall organic molecule
Emp. Form.C15H20ClN3O2
Mol. Mass.309.791
SMILESCOc1cc(N)c(Cl)cc1C(=O)N[C@@H]1CN2CCC1CC2