Reaction Details
TargetEndothelin-1 receptor
LigandBDBM50366421
Substrate/Competitorn/a
Meas. Tech.ChEBML_63195
IC50 14±n/a nM
Citation Leonard, DMReily, MDDunbar, JBHolub, KECody, WLHill, KEWelch, KMFlynn, MAReynolds, EEDoherty, AM Structure-activity and biophysical studies of the C-terminal hexapeptide of endothelin Bioorg Med Chem Lett5:967-972 (1995)    Article
 
Endothelin-1 receptor
Name:Endothelin-1 receptor
Type:Enzyme Catalytic Domain
Mol. Mass.:48736.88
Organism:Homo sapiens (Human)
Description:P25101
Residue:427
BDBM50366421
NameBDBM50366421
Synonyms:CHEMBL1791271
TypeSmall organic molecule
Emp. Form.C50H65N7O10
Mol. Mass.924.092
SMILESCC[C@H](C)[C@H](NC(=O)[C@@H](NC(=O)[C@H](CC(O)=O)NC(=O)[C@H](CC(C)C)NC(=O)[C@@H](NC(C)=O)C(c1ccccc1)c1ccccc1)[C@H](C)CC)C(=O)N[C@@H](Cc1c[nH]c2ccccc12)C(O)=O