Reaction Details
TargetDipeptidyl peptidase 4
LigandBDBM50228295
Substrate/Competitorn/a
Meas. Tech.ChEMBL_53500 (CHEMBL664122)
Ki 2100±n/a nM
Citation Ashworth, DMAtrash, BBaker, GRBaxter, AJJenkins, PDJones, DSzelke, M 2-cyanopyrrolidides as potent, stable inhibitors of dipeptidyl peptidase IV Bioorg Med Chem Lett6:1163-1166 (1996)    Article
 
Dipeptidyl peptidase 4
Name:Dipeptidyl peptidase 4
Type:Enzyme
Mol. Mass.:88271.01
Organism:Homo sapiens (Human)
Description:P27487
Residue:766
BDBM50228295
NameBDBM50228295
Synonyms:(S)-pyrrolidin-1-yl(pyrrolidin-2-yl)methanone | CHEMBL403882
TypeSmall organic molecule
Emp. Form.C9H16N2O
Mol. Mass.168.2361
SMILESO=C([C@@H]1CCCN1)N1CCCC1