Reaction Details
TargetDipeptidyl peptidase 4
LigandBDBM11694
Substrate/Competitorn/a
Meas. Tech.ChEBML_53500
Ki 1.4±n/a nM
Citation Ashworth, DMAtrash, BBaker, GRBaxter, AJJenkins, PDJones, DSzelke, M 2-cyanopyrrolidides as potent, stable inhibitors of dipeptidyl peptidase IV Bioorg Med Chem Lett6:1163-1166 (1996)    Article
 
Dipeptidyl peptidase 4
Name:Dipeptidyl peptidase 4
Type:Enzyme
Mol. Mass.:88271.01
Organism:Homo sapiens (Human)
Description:P27487
Residue:766
BDBM11694
NameBDBM11694
Synonyms:(2S)-1-[(2S)-2-amino-2-cyclohexylacetyl]pyrrolidine-2-carbonitrile CHEMBL307636 Cyclohexylglycine-(2S)-cyanopyrrolidine 2
TypeSmall organic molecule
Emp. Form.C13H21N3O
Mol. Mass.235.3253
SMILESN[C@@H](C1CCCCC1)C(=O)N1CCC[C@H]1C#N