Reaction Details
TargetDipeptidyl peptidase 4
LigandBDBM50287061
Substrate/Competitorn/a
Meas. Tech.ChEBML_53500
Ki 910±n/a nM
Citation Ashworth, DMAtrash, BBaker, GRBaxter, AJJenkins, PDJones, DSzelke, M 2-cyanopyrrolidides as potent, stable inhibitors of dipeptidyl peptidase IV Bioorg Med Chem Lett6:1163-1166 (1996)    Article
 
Dipeptidyl peptidase 4
Name:Dipeptidyl peptidase 4
Type:Enzyme
Mol. Mass.:88271.01
Organism:Homo sapiens (Human)
Description:P27487
Residue:766
BDBM50287061
NameBDBM50287061
Synonyms:CHEMBL16587 [4-Amino-1-(pyrrolidine-1-carbonyl)-butyl]-carbamic acid benzyl ester
TypeSmall organic molecule
Emp. Form.C17H25N3O3
Mol. Mass.319.3987
SMILESNCCC[C@H](NC(=O)OCc1ccccc1)C(=O)N1CCCC1