Reaction Details
TargetDipeptidyl peptidase 4
LigandBDBM50287062
Substrate/Competitorn/a
Meas. Tech.ChEBML_53500
Ki 5300±n/a nM
Citation Ashworth, DMAtrash, BBaker, GRBaxter, AJJenkins, PDJones, DSzelke, M 2-cyanopyrrolidides as potent, stable inhibitors of dipeptidyl peptidase IV Bioorg Med Chem Lett6:1163-1166 (1996)    Article
 
Dipeptidyl peptidase 4
Name:Dipeptidyl peptidase 4
Type:Enzyme
Mol. Mass.:88271.01
Organism:Homo sapiens (Human)
Description:P27487
Residue:766
BDBM50287062
NameBDBM50287062
Synonyms:2-Amino-2-phenyl-1-pyrrolidin-1-yl-ethanone CHEMBL3350821
TypeSmall organic molecule
Emp. Form.C12H16N2O
Mol. Mass.204.2682
SMILESN[C@H](C(=O)N1CCCC1)c1ccccc1