Reaction Details
TargetGlutamate--cysteine ligase catalytic subunit
LigandBDBM50287274
Substrate/Competitorn/a
Meas. Tech.ChEMBL_68755 (CHEMBL681832)
Ki 4950±n/a nM
Citation Katoh, MHiratake, JKato, HOda, J Mechanism-based inactivation of E. coli -glutamylcysteine synthetase by phosphinic acid- and sulfoximine-based transition-state analogues Bioorg Med Chem Lett6:1437-1442 (1996)    Article
 
Glutamate--cysteine ligase catalytic subunit
Name:Glutamate--cysteine ligase catalytic subunit
Type:PROTEIN
Mol. Mass.:72759.43
Organism:Homo sapiens (Human)
Description:ChEMBL_68753
Residue:637
BDBM50287274
NameBDBM50287274
Synonyms:(2S)-2-ammonio-4-[(2-carboxylatobutyl)phosphinato]butanoate
TypeSmall organic molecule
Emp. Form.C9H16NO6P
Mol. Mass.265.2013
SMILESCCC(CP([O-])(=O)CC[C@H]([NH3+])C([O-])=O)C([O-])=O