Reaction Details
TargetNeprilysin
LigandBDBM21641
Substrate/Competitorn/a
Meas. Tech.ChEBML_144631
IC50 7.9±n/a nM
Citation Kanno, HOsanai, KNishi, TIino, MKatakura, SFurugohri, TWatanabe, Y Synthesis and evaluation of 2-(biphenylmethyl)glutaric acid amide derivatives as neutral endopeptidase inhibitors. Bioorg Med Chem Lett6:1487-1490 (1996)    Article
 
Neprilysin
Name:Neprilysin
Type:Enzyme
Mol. Mass.:85505.38
Organism:Homo sapiens (Human)
Description:P08473
Residue:750
BDBM21641
NameBDBM21641
Synonyms:2-(2-benzyl-3-sulfanylpropanamido)acetic acid Thiorphan
TypeSmall organic molecule
Emp. Form.C12H15NO3S
Mol. Mass.253.317
SMILESOC(=O)CNC(=O)C(CS)Cc1ccccc1