Reaction Details
Target2-5A-dependent ribonuclease
LigandBDBM50366437
Substrate/Competitorn/a
Meas. Tech.ChEMBL_164142 (CHEMBL771466)
IC50 50±n/a nM
Citation Sawai, HIto, TKokaji, KShimazu, MShinozuka, KTaira, H Synthesis and properties of 25 and 35 linked -oligoriboadenylates Bioorg Med Chem Lett6:1785-1790 (1996)    Article
 
2-5A-dependent ribonuclease
Name:2-5A-dependent ribonuclease
Type:PROTEIN
Mol. Mass.:83274.00
Organism:Mus musculus
Description:ChEMBL_195099
Residue:735
BDBM50366437
NameBDBM50366437
Synonyms:CHEMBL608874
TypeSmall organic molecule
Emp. Form.C29H36N15O19P3
Mol. Mass.991.6065
SMILESNc1ncnc2n(cnc12)C1O[C@H](COP(O)(=O)O[C@@H]2[C@H](O)[C@@H](COP(O)(=O)O[C@@H]3[C@H](O)[C@@H](OP(O)(O)=O)O[C@H]3n3cnc4c(N)ncnc34)O[C@H]2n2cnc3c(N)ncnc23)[C@@H](O)[C@H]1O