Reaction Details
TargetNeuraminidase
LigandBDBM4940
Substrate/Competitorn/a
Meas. Tech.ChEBML_200638
IC50 2±n/a nM
Citation Sollis, SLSmith, PWHowes, PDCherry, PCBethell, RC Novel inhibitors of influenza sialidase related to GG167 Synthesis of 4-amino and guanidino-4H-pyran-2-carboxylic acid-6-propylamides; selective inhibitors of influenza a virus sialidase Bioorg Med Chem Lett6:1805-1808 (1996)    Article
 
Neuraminidase
Name:Neuraminidase
Type:Enzyme
Mol. Mass.:50124.14
Organism:Influenza A virus (A/Puerto Rico/8/34/Mount Sinai(H1N1))
Description:P03468
Residue:454
BDBM4940
NameBDBM4940
Synonyms:(2R,3R,4S)-4-carbamimidamido-2-(dipropylcarbamoyl)-3-acetamido-3,4-dihydro-2H-pyran-6-carboxylic acid | carboxamide deriv. 5g
TypeSmall organic molecule
Emp. Form.C16H27N5O5
Mol. Mass.369.4161
SMILES[H][C@]1([#8]-[#6](=[#6]-[#6@H](\[#7]=[#6](/[#7])-[#7])-[#6@H]1-[#7]-[#6](-[#6])=O)-[#6](-[#8])=O)[#6](=O)-[#7](-[#6]-[#6]-[#6])-[#6]-[#6]-[#6]