Reaction Details
TargetHLA class II histocompatibility antigen, DR beta 3 chain
LigandBDBM50287631
Substrate/Competitorn/a
Meas. Tech.ChEBML_47860
IC50>100000±n/a nM
Citation Hanson, GJVuletich, JLBedell, LJBono, CPHoward, SCWelply, JKWoulfe, SLZacheis, ML Design of MHC class II (DR4) ligands using conformationally restricted imino acids at p3 and p5 Bioorg Med Chem Lett6:1931-1936 (1996)    Article
 
HLA class II histocompatibility antigen, DR beta 3 chain
Name:HLA class II histocompatibility antigen, DR beta 3 chain
Type:PROTEIN
Mol. Mass.:29969.73
Organism:Homo sapiens (Human)
Description:ChEMBL_47860
Residue:266
BDBM50287631
NameBDBM50287631
Synonyms:3-({1-[(S)-2-((R)-3-Cyclohexyl-butyrylamino)-3-methyl-butyryl]-piperidine-2-carbonyl}-amino)-propionic acid | CHEMBL58489
TypeSmall organic molecule
Emp. Form.C24H41N3O5
Mol. Mass.451.5994
SMILESCC(C)[C@H](NC(=O)C[C@@H](C)C1CCCCC1)C(=O)N1CCCCC1C(=O)NCCC(O)=O