Reaction Details
TargetHLA class II histocompatibility antigen, DR beta 3 chain
LigandBDBM50287644
Substrate/Competitorn/a
Meas. Tech.ChEBML_47860
IC50>100000±n/a nM
Citation Hanson, GJVuletich, JLBedell, LJBono, CPHoward, SCWelply, JKWoulfe, SLZacheis, ML Design of MHC class II (DR4) ligands using conformationally restricted imino acids at p3 and p5 Bioorg Med Chem Lett6:1931-1936 (1996)    Article
 
HLA class II histocompatibility antigen, DR beta 3 chain
Name:HLA class II histocompatibility antigen, DR beta 3 chain
Type:PROTEIN
Mol. Mass.:29969.73
Organism:Homo sapiens (Human)
Description:ChEMBL_47860
Residue:266
BDBM50287644
NameBDBM50287644
Synonyms:1-[(S)-2-(2-Cyclohexylamino-acetylamino)-3-methyl-butyryl]-piperidine-2-carboxylic acid {(S)-1-[(S)-2-((1S,2R)-2-hydroxy-1-propylcarbamoyl-propylcarbamoyl)-pyrrolidine-1-carbonyl]-3-methylsulfanyl-propyl}-amide | CHEMBL2373035
TypeSmall organic molecule
Emp. Form.C36H63N7O7S
Mol. Mass.737.993
SMILESCCCNC(=O)[C@@H](NC(=O)[C@@H]1CCCN1C(=O)[C@H](CCSC)NC(=O)[C@@H]1CCCCN1C(=O)[C@@H](NC(=O)CNC1CCCCC1)C(C)C)[C@@H](C)O