Reaction Details
TargetHLA class II histocompatibility antigen, DR beta 3 chain
LigandBDBM50287650
Substrate/Competitorn/a
Meas. Tech.ChEBML_47860
IC50 130±n/a nM
Citation Hanson, GJVuletich, JLBedell, LJBono, CPHoward, SCWelply, JKWoulfe, SLZacheis, ML Design of MHC class II (DR4) ligands using conformationally restricted imino acids at p3 and p5 Bioorg Med Chem Lett6:1931-1936 (1996)    Article
 
HLA class II histocompatibility antigen, DR beta 3 chain
Name:HLA class II histocompatibility antigen, DR beta 3 chain
Type:PROTEIN
Mol. Mass.:29969.73
Organism:Homo sapiens (Human)
Description:ChEMBL_47860
Residue:266
BDBM50287650
NameBDBM50287650
Synonyms:(S)-3-({1-[2-Cyclohexyl-2-((R)-3-cyclohexyl-butyrylamino)-acetyl]-piperidine-2-carbonyl}-amino)-4-[(S)-2-((1S,2R)-2-hydroxy-1-propylcarbamoyl-propylcarbamoyl)-pyrrolidin-1-yl]-4-oxo-butyric acid | CHEMBL2373033
TypeSmall organic molecule
Emp. Form.C36H60N6O9
Mol. Mass.720.8964
SMILESCCCNC(=O)[C@@H](NC(=O)[C@@H]1CCCN1C(=O)[C@H](CC(O)=O)NC(=O)[C@@H]1CCCCN1C(=O)[C@@H](NC(=O)CCC1CCCCC1)C(C)C)[C@@H](C)O