Reaction Details
TargetHLA class II histocompatibility antigen, DR beta 3 chain
LigandBDBM50287652
Substrate/Competitorn/a
Meas. Tech.ChEBML_47860
IC50 7000±n/a nM
Citation Hanson, GJVuletich, JLBedell, LJBono, CPHoward, SCWelply, JKWoulfe, SLZacheis, ML Design of MHC class II (DR4) ligands using conformationally restricted imino acids at p3 and p5 Bioorg Med Chem Lett6:1931-1936 (1996)    Article
 
HLA class II histocompatibility antigen, DR beta 3 chain
Name:HLA class II histocompatibility antigen, DR beta 3 chain
Type:PROTEIN
Mol. Mass.:29969.73
Organism:Homo sapiens (Human)
Description:ChEMBL_47860
Residue:266
BDBM50287652
NameBDBM50287652
Synonyms:3-({(S)-1-[2-(3-Cyclohexyl-butyrylamino)-3-methyl-butyryl]-piperidine-2-carbonyl}-amino)-4-[(S)-2-((R)-(R)-2-hydroxy-1-hydroxymethyl-propylcarbamoyl)-pyrrolidin-1-yl]-4-oxo-butyric acid | CHEMBL2373018
TypeSmall organic molecule
Emp. Form.C34H57N5O9
Mol. Mass.679.8445
SMILESCC(C)[C@H](NC(=O)C[C@H](C)C1CCCCC1)C(=O)N1CCCC[C@H]1C(=O)N[C@@H](CC(O)=O)C(=O)N1CCC[C@H]1C(=O)N[C@H](CO)[C@@H](C)O