Reaction Details
TargetHLA class II histocompatibility antigen, DR beta 3 chain
LigandBDBM50287653
Substrate/Competitorn/a
Meas. Tech.ChEBML_47860
IC50 43700±n/a nM
Citation Hanson, GJVuletich, JLBedell, LJBono, CPHoward, SCWelply, JKWoulfe, SLZacheis, ML Design of MHC class II (DR4) ligands using conformationally restricted imino acids at p3 and p5 Bioorg Med Chem Lett6:1931-1936 (1996)    Article
 
HLA class II histocompatibility antigen, DR beta 3 chain
Name:HLA class II histocompatibility antigen, DR beta 3 chain
Type:PROTEIN
Mol. Mass.:29969.73
Organism:Homo sapiens (Human)
Description:ChEMBL_47860
Residue:266
BDBM50287653
NameBDBM50287653
Synonyms:1-[(S)-2-((R)-3-Cyclohexyl-butyrylamino)-3-methyl-butyryl]-piperidine-2-carboxylic acid {1-[(S)-2-((1S,2R)-2-hydroxy-1-propylcarbamoyl-propylcarbamoyl)-pyrrolidine-1-carbonyl]-but-3-ynyl}-amide | CHEMBL2373023
TypeSmall organic molecule
Emp. Form.C38H62N6O7
Mol. Mass.714.9349
SMILESCCCNC(=O)[C@@H](NC(=O)[C@@H]1CCCN1C(=O)[C@H](CC#C)NC(=O)[C@@H]1CCCCN1C(=O)[C@@H](NC(=O)C[C@H](C)C1CCCCC1)C(C)C)[C@@H](C)O