Reaction Details
TargetEndothelin receptor type B
LigandBDBM50287881
Substrate/Competitorn/a
Meas. Tech.ChEBML_63860
Ki>10000±n/a nM
Citation Fruh, TSaika, HSvensson, LPitterna, TSakaki, JOkada, TUrade, YOda, KFujitani, YTakimoto, MYamamura, TInui, TMakatani, MUmemura, ITeno, NToh, HHayakawa, KMurata, T IRL 2500: A potent ETB selective endothelin antagonist Bioorg Med Chem Lett6:2323-2328 (1996)    Article
 
Endothelin receptor type B
Name:Endothelin receptor type B
Type:PROTEIN
Mol. Mass.:49616.89
Organism:Sus scrofa
Description:ChEMBL_63872
Residue:443
BDBM50287881
NameBDBM50287881
Synonyms:CHEMBL216772 | Suc-Glu-Ala-Val-Tyr-Phe-Ala-His-Leu-Asp-lle-lle-Gly-COOH
TypeSmall organic molecule
Emp. Form.C68H98N14O21
Mol. Mass.1447.5869
SMILESCC[C@@H](C)[C@H](NC(=O)[C@@H](NC(=O)[C@H](CC(O)=O)NC(=O)[C@H](CC(C)C)NC(=O)[C@H](Cc1cnc[nH]1)NC(=O)[C@H](C)NC(=O)[C@H](Cc1ccccc1)NC(=O)[C@H](Cc1ccc(O)cc1)NC(=O)[C@@H](NC(=O)[C@H](C)NC(=O)[C@H](CCC(O)=O)NC(=O)CCC(O)=O)C(C)C)[C@@H](C)CC)C(=O)NCC(O)=O