Reaction Details
TargetEndothelin receptor type B
LigandBDBM50287887
Substrate/Competitorn/a
Meas. Tech.ChEBML_63860
Ki 11±n/a nM
Citation Fruh, TSaika, HSvensson, LPitterna, TSakaki, JOkada, TUrade, YOda, KFujitani, YTakimoto, MYamamura, TInui, TMakatani, MUmemura, ITeno, NToh, HHayakawa, KMurata, T IRL 2500: A potent ETB selective endothelin antagonist Bioorg Med Chem Lett6:2323-2328 (1996)    Article
 
Endothelin receptor type B
Name:Endothelin receptor type B
Type:PROTEIN
Mol. Mass.:49616.89
Organism:Sus scrofa
Description:ChEMBL_63872
Residue:443
BDBM50287887
NameBDBM50287887
Synonyms:CHEMBL413604 | Suc-Glu-Ala-Val-Gly-Phe-Ala-His-Leu-Asp-lle-lle-Trp-COOH
TypeSmall organic molecule
Emp. Form.C70H99N15O20
Mol. Mass.1470.6236
SMILESCC[C@H](C)[C@H](NC(=O)[C@H](CC(O)=O)NC(=O)[C@H](CC(C)C)NC(=O)[C@H](Cc1cnc[nH]1)NC(=O)[C@@H](C)NC(=O)[C@H](Cc1ccccc1)NC(=O)CNC(=O)[C@@H](NC(=O)[C@H](C)NC(=O)[C@H](CCC(O)=O)NC(=O)CCC(O)=O)C(C)C)C(=O)N[C@@H]([C@@H](C)CC)C(=O)N[C@@H](Cc1c[nH]c2ccccc12)C(O)=O