Reaction Details
TargetEndothelin-1 receptor
LigandBDBM50071431
Substrate/Competitorn/a
Meas. Tech.ChEBML_65818
Ki 11000±n/a nM
Citation Fruh, TSaika, HSvensson, LPitterna, TSakaki, JOkada, TUrade, YOda, KFujitani, YTakimoto, MYamamura, TInui, TMakatani, MUmemura, ITeno, NToh, HHayakawa, KMurata, T IRL 2500: A potent ETB selective endothelin antagonist Bioorg Med Chem Lett6:2323-2328 (1996)    Article
 
Endothelin-1 receptor
Name:Endothelin-1 receptor
Type:PROTEIN
Mol. Mass.:48707.29
Organism:Sus scrofa
Description:ChEMBL_65803
Residue:427
BDBM50071431
NameBDBM50071431
Synonyms:(S)-2-{(R)-2-[(3,5-Dimethyl-benzoyl)-methyl-amino]-3-phenyl-propionylamino}-3-(1H-indol-3-yl)-propionic acid | CHEMBL439759
TypeSmall organic molecule
Emp. Form.C30H31N3O4
Mol. Mass.497.5848
SMILESCN([C@H](Cc1ccccc1)C(=O)N[C@@H](Cc1c[nH]c2ccccc12)C(O)=O)C(=O)c1cc(C)cc(C)c1