Reaction Details
TargetNeuromedin-B receptor
LigandBDBM50071754
Substrate/Competitorn/a
Meas. Tech.ChEBML_143209
IC50 150±n/a nM
Citation Eden, JHall, MHigginbottom, MHorwell, DHowson, WHughes, JJordan, RLewthwaite, RMartin, KMcKnight, APinnock, RPritchard, MSuman-Chauhan, NWilliams, S PD 165929 the first high affinity non-peptide neuromedin-B (NMB) receptor selective antagonist Bioorg Med Chem Lett6:2617-2622 (1996)    Article
 
Neuromedin-B receptor
Name:Neuromedin-B receptor
Type:Enzyme Catalytic Domain
Mol. Mass.:43540.92
Organism:RAT
Description:NMB 0 RAT::P24053
Residue:390
BDBM50071754
NameBDBM50071754
Synonyms:(S)-2-[3-(2,6-Diisopropyl-phenyl)-ureido]-3-(1H-indol-3-yl)-2-methyl-N-(1-pyridin-2-yl-cyclohexylmethyl)-propionamide NMB | Xenopus NMB
TypeSmall organic molecule
Emp. Form.C37H47N5O2
Mol. Mass.593.8014
SMILESCC(C)c1cccc(C(C)C)c1NC(=O)N[C@@](C)(Cc1c[nH]c2ccccc12)C(=O)NCC1(CCCCC1)c1ccccn1