Reaction Details
TargetGastrin-releasing peptide receptor
LigandBDBM50288243
Substrate/Competitorn/a
Meas. Tech.ChEBML_71531
Ki>10000±n/a nM
Citation Eden, JHall, MHigginbottom, MHorwell, DHowson, WHughes, JJordan, RLewthwaite, RMartin, KMcKnight, APinnock, RPritchard, MSuman-Chauhan, NWilliams, S PD 165929 the first high affinity non-peptide neuromedin-B (NMB) receptor selective antagonist Bioorg Med Chem Lett6:2617-2622 (1996)    Article
 
Gastrin-releasing peptide receptor
Name:Gastrin-releasing peptide receptor
Type:Enzyme Catalytic Domain
Mol. Mass.:43214.53
Organism:Homo sapiens (Human)
Description:Bombesin 2 GRPR 0::P30550
Residue:384
BDBM50288243
NameBDBM50288243
Synonyms:2-[3-(2,6-Diisopropyl-phenyl)-ureido]-3-(1H-indol-3-yl)-2-methyl-N-(1-phenyl-cyclohexylmethyl)-propionamide | CHEMBL329561
TypeSmall organic molecule
Emp. Form.C38H48N4O2
Mol. Mass.592.8133
SMILESCC(C)c1cccc(C(C)C)c1NC(=O)NC(C)(Cc1c[nH]c2ccccc12)C(=O)NCC1(CCCCC1)c1ccccc1