Reaction Details
TargetGastrin-releasing peptide receptor
LigandBDBM50288249
Substrate/Competitorn/a
Meas. Tech.ChEBML_71531
Ki>10000±n/a nM
Citation Eden, JHall, MHigginbottom, MHorwell, DHowson, WHughes, JJordan, RLewthwaite, RMartin, KMcKnight, APinnock, RPritchard, MSuman-Chauhan, NWilliams, S PD 165929 the first high affinity non-peptide neuromedin-B (NMB) receptor selective antagonist Bioorg Med Chem Lett6:2617-2622 (1996)    Article
 
Gastrin-releasing peptide receptor
Name:Gastrin-releasing peptide receptor
Type:Enzyme Catalytic Domain
Mol. Mass.:43214.53
Organism:Homo sapiens (Human)
Description:Bombesin 2 GRPR 0::P30550
Residue:384
BDBM50288249
NameBDBM50288249
Synonyms:CHEMBL312851 | N-(1-Cyclohexyl-ethyl)-2-[3-(2,6-diisopropyl-phenyl)-ureido]-3-(1H-indol-3-yl)-propionamide
TypeSmall organic molecule
Emp. Form.C32H44N4O2
Mol. Mass.516.7174
SMILESCC(C)c1cccc(C(C)C)c1NC(=O)NC(Cc1c[nH]c2ccccc12)C(=O)NC(C)C1CCCCC1