Reaction Details
TargetNeuromedin-B receptor
LigandBDBM50288250
Substrate/Competitorn/a
Meas. Tech.ChEBML_143206
Ki 420±n/a nM
Citation Eden, JHall, MHigginbottom, MHorwell, DHowson, WHughes, JJordan, RLewthwaite, RMartin, KMcKnight, APinnock, RPritchard, MSuman-Chauhan, NWilliams, S PD 165929 the first high affinity non-peptide neuromedin-B (NMB) receptor selective antagonist Bioorg Med Chem Lett6:2617-2622 (1996)    Article
 
Neuromedin-B receptor
Name:Neuromedin-B receptor
Type:Enzyme Catalytic Domain
Mol. Mass.:43447.11
Organism:Homo sapiens (Human)
Description:Bombesin 1 NMBR 0::P28336
Residue:390
BDBM50288250
NameBDBM50288250
Synonyms:2-[3-(2,6-Diisopropyl-phenyl)-ureido]-N-((R)-2,2-dimethyl-4-phenyl-[1,3]dioxan-5-yl)-3-(1H-indol-3-yl)-2-methyl-propionamide | CHEMBL406037
TypeSmall organic molecule
Emp. Form.C37H46N4O4
Mol. Mass.610.7855
SMILESCC(C)c1cccc(C(C)C)c1NC(=O)NC(C)(Cc1c[nH]c2ccccc12)C(=O)N[C@@H]1COC(C)(C)OC1c1ccccc1