Reaction Details
TargetGastrin-releasing peptide receptor
LigandBDBM50288253
Substrate/Competitorn/a
Meas. Tech.ChEBML_71531
Ki 1500±n/a nM
Citation Eden, JHall, MHigginbottom, MHorwell, DHowson, WHughes, JJordan, RLewthwaite, RMartin, KMcKnight, APinnock, RPritchard, MSuman-Chauhan, NWilliams, S PD 165929 the first high affinity non-peptide neuromedin-B (NMB) receptor selective antagonist Bioorg Med Chem Lett6:2617-2622 (1996)    Article
 
Gastrin-releasing peptide receptor
Name:Gastrin-releasing peptide receptor
Type:Enzyme Catalytic Domain
Mol. Mass.:43214.53
Organism:Homo sapiens (Human)
Description:Bombesin 2 GRPR 0::P30550
Residue:384
BDBM50288253
NameBDBM50288253
Synonyms:CHEMBL328591 | N-Cyclohexylmethyl-2-[3-(2,6-diisopropyl-phenyl)-1-methyl-ureido]-3-(1H-indol-3-yl)-propionamide
TypeSmall organic molecule
Emp. Form.C32H44N4O2
Mol. Mass.516.7174
SMILESCC(C)c1cccc(C(C)C)c1NC(=O)N(C)C(Cc1c[nH]c2ccccc12)C(=O)NCC1CCCCC1