Reaction Details
TargetGastrin-releasing peptide receptor
LigandBDBM50366467
Substrate/Competitorn/a
Meas. Tech.ChEBML_71531
Ki>10000±n/a nM
Citation Eden, JHall, MHigginbottom, MHorwell, DHowson, WHughes, JJordan, RLewthwaite, RMartin, KMcKnight, APinnock, RPritchard, MSuman-Chauhan, NWilliams, S PD 165929 the first high affinity non-peptide neuromedin-B (NMB) receptor selective antagonist Bioorg Med Chem Lett6:2617-2622 (1996)    Article
 
Gastrin-releasing peptide receptor
Name:Gastrin-releasing peptide receptor
Type:Enzyme Catalytic Domain
Mol. Mass.:43214.53
Organism:Homo sapiens (Human)
Description:Bombesin 2 GRPR 0::P30550
Residue:384
BDBM50366467
NameBDBM50366467
Synonyms:CHEMBL1907865
TypeSmall organic molecule
Emp. Form.C35H42N4O2
Mol. Mass.550.7336
SMILESCC(C)c1cccc(C(C)C)c1NC(=O)N[C@](C)(Cc1c[nH]c2ccccc12)C(=O)NC1CCCc2ccccc12