Reaction Details
Target3-phosphoshikimate 1-carboxyvinyltransferase
LigandBDBM50403587
Substrate/Competitorn/a
Meas. Tech.ChEMBL_65096 (CHEMBL670573)
Ki 5±n/a nM
Citation Peterson, MLCorey, SDFont, JLWalker, MCSikorski, JA New simplified inhibitors of EPSP synthase: The importance of ring size for recognition at the shikimate 3-phosphate site Bioorg Med Chem Lett6:2853-2858 (1996)    Article
 
3-phosphoshikimate 1-carboxyvinyltransferase
Name:3-phosphoshikimate 1-carboxyvinyltransferase
Type:PROTEIN
Mol. Mass.:46089.22
Organism:Escherichia coli (strain K12)
Description:ChEMBL_65087
Residue:427
BDBM50403587
NameBDBM50403587
Synonyms:CHEMBL1627013
TypeSmall organic molecule
Emp. Form.C10H15O13P2
Mol. Mass.405.1664
SMILESC[C@@](O[C@@H]1CC(=C[C@@H](OP(O)(O)=O)[C@H]1O)C([O-])=O)(C(O)=O)P(O)(O)=O