Reaction Details
TargetNeuraminidase
LigandBDBM4952
Substrate/Competitorn/a
Meas. Tech.ChEBML_200636
IC50 5±n/a nM
Citation Smith, PWSollis, SLHowes, PDCherry, PCCobley, KNTaylor, HWhittington, ARScicinski, JBethell, RCTaylor, NSkarzynski, TCleasby, ASingh, OWonacott, AVarghese, JColman, P Novel inhibitors of influenza sialidases related to GG167 structure-activity, crystallographic and Molecular dynamics studies with 4H-pyran-2-carboxylic acid 6-carboxamides Bioorg Med Chem Lett6:2931-2936 (1996)    Article
 
Neuraminidase
Name:Neuraminidase
Type:Enzyme
Mol. Mass.:50124.14
Organism:Influenza A virus (A/Puerto Rico/8/34/Mount Sinai(H1N1))
Description:P03468
Residue:454
BDBM4952
NameBDBM4952
Synonyms:(2R,3R,4S)-4-amino-3-acetamido-2-[ethyl(2-phenylethyl)carbamoyl]-3,4-dihydro-2H-pyran-6-carboxylic acid carboxamide deriv. 4u
TypeSmall organic molecule
Emp. Form.C19H25N3O5
Mol. Mass.375.4189
SMILES[H][C@]1(OC(=C[C@H](N)[C@H]1NC(C)=O)C(O)=O)C(=O)N(CC)CCc1ccccc1