Reaction Details
Target5-hydroxytryptamine receptor 3A/3B
LigandBDBM50288592
Substrate/Competitorn/a
Meas. Tech.ChEMBL_2989 (CHEMBL621506)
Ki 10±n/a nM
Citation Fancelli, DCaccia, CFornaretto, MMcArthur, RSeverino, DVaghi, FVarasi, M Serotoninergic 5-HT3 and 5-HT4 receptor activities of dihydrobenzofuran carboxylic acid derivatives Bioorg Med Chem Lett6:263-266 (1996)    Article
 
5-hydroxytryptamine receptor 3A/3B
Name:5-hydroxytryptamine receptor 3A/3B
Type:n/a
Mol. Mass.:n/a
Description:ASSAY_ID of EBI is 2974
Components:This complex has 2 components.
Component 1
Name:5-hydroxytryptamine receptor 3B
Synonyms:5HT3B_RAT Serotonin (5-HT) receptor
Type:PROTEIN
Mol. Mass.:50328.78
Organism:Rattus norvegicus
Description:EBI_11885
Residue:437
Component 2
Name:5-hydroxytryptamine receptor 3A
Synonyms:5-HT3 5HT3A_RAT Htr3 Serotonin (5-HT) receptor | Zacopride site-R
Type:Enzyme Catalytic Domain
Mol. Mass.:55428.70
Organism:RAT
Description:5-HT3 HTR3A RAT::P35563
Residue:483
BDBM50288592
NameBDBM50288592
Synonyms:(R)-3-[(4-Amino-5-chloro-2,3-dihydro-benzofuran-7-carbonyl)-amino]-1-butyl-1-azonia-bicyclo[2.2.2]octane; bromide | CHEMBL314198
TypeSmall organic molecule
Emp. Form.C20H29ClN3O2
Mol. Mass.378.916
SMILESCCCC[N+]12CCC(CC1)[C@H](C2)NC(=O)c1cc(Cl)c(N)c2CCOc12