Reaction Details
Target5-hydroxytryptamine receptor 4
LigandBDBM50288590
Substrate/Competitorn/a
Meas. Tech.ChEMBL_3344 (CHEMBL619044)
Ki 8.3±n/a nM
Citation Fancelli, DCaccia, CFornaretto, MMcArthur, RSeverino, DVaghi, FVarasi, M Serotoninergic 5-HT3 and 5-HT4 receptor activities of dihydrobenzofuran carboxylic acid derivatives Bioorg Med Chem Lett6:263-266 (1996)    Article
 
5-hydroxytryptamine receptor 4
Name:5-hydroxytryptamine receptor 4
Type:Enzyme Catalytic Domain
Mol. Mass.:46117.31
Organism:RAT
Description:5-HT4 HTR4 RAT::Q62758
Residue:406
BDBM50288590
NameBDBM50288590
Synonyms:4-Amino-5-chloro-2,3-dihydro-benzofuran-7-carboxylic acid (S)-(1-aza-bicyclo[2.2.2]oct-3-yl) ester | CHEMBL92100
TypeSmall organic molecule
Emp. Form.C16H19ClN2O3
Mol. Mass.322.787
SMILESNc1c2CCOc2c(cc1Cl)C(=O)O[C@@H]1CN2CCC1CC2