Reaction Details
Target5-hydroxytryptamine receptor 4
LigandBDBM50288584
Substrate/Competitorn/a
Meas. Tech.ChEBML_3344
Ki 1.9±n/a nM
Citation Fancelli, DCaccia, CFornaretto, MMcArthur, RSeverino, DVaghi, FVarasi, M Serotoninergic 5-HT3 and 5-HT4 receptor activities of dihydrobenzofuran carboxylic acid derivatives Bioorg Med Chem Lett6:263-266 (1996)    Article
 
5-hydroxytryptamine receptor 4
Name:5-hydroxytryptamine receptor 4
Type:Enzyme Catalytic Domain
Mol. Mass.:46117.31
Organism:RAT
Description:5-HT4 HTR4 RAT::Q62758
Residue:406
BDBM50288584
NameBDBM50288584
Synonyms:(S)-3-[(4-Amino-5-chloro-2,3-dihydro-benzofuran-7-carbonyl)-amino]-1-butyl-1-azonia-bicyclo[2.2.2]octane; bromide | CHEMBL423504
TypeSmall organic molecule
Emp. Form.C20H29ClN3O2
Mol. Mass.378.916
SMILESCCCC[N+]12CCC(CC1)[C@@H](C2)NC(=O)c1cc(Cl)c(N)c2CCOc12