Reaction Details
TargetAcetylcholinesterase
LigandBDBM10972
Substrate/Competitorn/a
Meas. Tech.ChEBML_29085
IC50 600±n/a nM
Citation Jaen, JCGregor, VELee, CDavis, REmmerling, M Acetylcholinesterase inhibition by fused dihydroquinazoline compounds Bioorg Med Chem Lett6:737-742 (1996)    Article
 
Acetylcholinesterase
Name:Acetylcholinesterase
Type:Enzyme
Mol. Mass.:68193.62
Organism:Rattus norvegicus (rat)
Description:P37136
Residue:614
BDBM10972
NameBDBM10972
Synonyms:(3aS,8aR)-1,3a,8-trimethyl-1H,2H,3H,3aH,8H,8aH-pyrrolo[2,3-b]indol-5-yl N-heptylcarbamate Eptastigmine | Heptylphysostigmine
TypeSmall organic molecule
Emp. Form.C21H33N3O2
Mol. Mass.359.5056
SMILES[H][C@]12N(C)CC[C@@]1(C)c1cc(OC(=O)NCCCCCCC)ccc1N2C