Reaction Details
TargetMuscarinic acetylcholine receptor M1
LigandBDBM50018056
Substrate/Competitorn/a
Meas. Tech.ChEBML_139536
Ki 179±n/a nM
Citation Murgolo, NJKozlowski, JTice, MAHollinger, FPBrown, JEZhou, GTaylor, LAMcQuade, RD The N4 nitrogen of pirenzepine is responsible for selective binding of the M1 subtype human muscarinic receptor Bioorg Med Chem Lett6:785-788 (1996)    Article
 
Muscarinic acetylcholine receptor M1
Name:Muscarinic acetylcholine receptor M1
Type:Protein
Mol. Mass.:51442.54
Organism:Homo sapiens (Human)
Description:P11229
Residue:460
BDBM50018056
NameBDBM50018056
Synonyms:(AF-DX 116) 11-[2-(2-Diethylaminomethyl-piperidin-1-yl)-acetyl]-5,11-dihydro-benzo[e]pyrido[3,2-b][1,4]diazepin-6-one 2-Diethylaminomethyl-1-[2-oxo-2-(6-oxo-5,6-dihydro-benzo[e]pyrido[3,2-b][1,4]diazepin-11-yl)-ethyl]-piperidinium AF-DX 116 CHEMBL17045 | Otenzepad
TypeSmall organic molecule
Emp. Form.C24H31N5O2
Mol. Mass.421.5352
SMILESCCN(CC)CC1CCCCN1CC(=O)N1c2ccccc2C(=O)Nc2cccnc12