Reaction Details
TargetProthrombin
LigandBDBM50069922
Substrate/Competitorn/a
Meas. Tech.ChEMBL_208538 (CHEMBL813632)
Ki 0.04±n/a nM
Citation Dominguez, CCarini, DWeber, PKnabb, RAlexander, RKettner, CWexler, R S1 heterocyclic thrombin inhibitors Bioorg Med Chem Lett7:79-84 (1997)    Article
 
Prothrombin
Name:Prothrombin
Type:Protein
Mol. Mass.:70029.57
Organism:Homo sapiens (Human)
Description:P00734
Residue:622
BDBM50069922
NameBDBM50069922
Synonyms:Boropeptide analogue | CHEMBL102069
TypeSmall organic molecule
Emp. Form.C21H33BN6O5
Mol. Mass.460.335
SMILESCC(=O)NC(Cc1ccccc1)C(=O)N1CCC[C@H]1C(=O)NC(CCCNC(N)=N)B(O)O