Reaction Details
TargetPlasminogen
LigandBDBM50069190
Substrate/Competitorn/a
Meas. Tech.ChEBML_155599
Ki>20000±n/a nM
Citation Sanderson, PEDyer, DLNaylor-Olsen, AMVacca, JPGardell, SJDale Lewis, SLucas, BJLyle, EALynch, JJMulichak, AM L-373,890, An achiral, noncovalent, subnanomolar thrombin inhibitor Bioorg Med Chem Lett7:1497-1500 (1997)    Article
 
Plasminogen
Name:Plasminogen
Type:Protein
Mol. Mass.:90541.87
Organism:Rattus norvegicus
Description:Q01177
Residue:812
BDBM50069190
NameBDBM50069190
Synonyms:CHEMBL287614 | N-(1-Carbamimidoyl-piperidin-4-ylmethyl)-2-(6-methyl-2-oxo-3-phenylmethanesulfonylamino-2H-pyridin-1-yl)-acetamide
TypeSmall organic molecule
Emp. Form.C22H30N6O4S
Mol. Mass.474.576
SMILESCc1ccc(NS(=O)(=O)Cc2ccccc2)c(=O)n1CC(=O)NCC1CCN(CC1)C(N)=N